{"text_format":"1","workbook":"xlsx","n_sheets":5,"sheets":["Instructions","Yeast Selection Planner","Variety-Yeast Mapping","SpecApp-Yeast Mapping","Lists"],"not_rendered":{"charts":0,"images":2,"macros":1,"external_links":0,"defined_names":1,"comments":0,"pivot_tables":0},"unopened":[],"bounds":{"document_bytes":16777216,"sheet_cells":100000,"rows_first":2000,"rows_last":500,"rows_between":2000,"halvings":0,"cell_chars":16384,"cell_head_chars":4096},"cells_cut":0,"cells_raw":0,"read":"whole","date_system":"1900"}

{"sheet":"Instructions","index":0,"n_rows":0,"n_cols":0,"rows_kept":0,"cut":false,"hidden":false,"merged":[]}

{"sheet":"Yeast Selection Planner","index":1,"n_rows":14,"n_cols":10,"rows_kept":14,"cut":false,"hidden":false,"merged":[[14,1,14,9],[15,1,15,9],[16,1,16,9],[0,1,0,9],[1,1,1,9],[2,1,2,9],[13,1,13,9]]}
[null,"YEAST SELECTION PLANNER"]
[null,"Version 1.0"]
[null,"© Daniel Pambianchi, 2021"]
[]
[null,"What volume unit are you using: L, hL or gal?",null,null,null,null,"gal"]
[]
[null,null,"Grape Variety","Vendor","High Sugar? (SG>1.110, Brix>26)","Malic?",{"$f":"CONCATENATE(\"Estimated Volume (\",G5,\")\")","v":"Estimated Volume (gal)"},null,"Recommended Yeasts","Est. Required Amount"]
[null,null,null,null,null,null,null,null,{"$f":"IF(OR(ISBLANK(C8),ISBLANK(D8)),(IF(AND(ISBLANK(C8),ISBLANK(D8)),IF(G8<>\"\",\"Select a Grape Variety and a Vendor\",\"\"),(IF(ISBLANK(C8),\"Select a Grape Variety\",\"Select a Vendor\")))),CONCATENATE((VLOOKUP(C8,'Variety-Yeast Mapping'!$A$1:$I$51,IF(D8=\"Lallemand\",2,IF(D8=\"Laffort\",3,IF(D8=\"Enartis\",4,IF(D8=\"Red Star\",5,IF(D8=\"White Labs\",6,IF(D8=\"Wyeast\",7,IF(D8=\"Renaissance\",8,IF(D8=\"AB Biotek\",9,\"ERROR\")))))))),FALSE)),IF(AND((VLOOKUP(\"Malic Acid Degradation\",'SpecApp-Yeast Mapping'!$A$1:$I$3,IF(D8=\"Lallemand\",2,IF(D8=\"Laffort\",3,IF(D8=\"Enartis\",4,IF(D8=\"Red Star\",5,IF(D8=\"White Labs\",6,IF(D8=\"Wyeast\",7,IF(D8=\"Renaissance\",8,IF(D8=\"AB Biotek\",9,\"ERROR\")))))))),FALSE))<>\"\",F8=\"YES\"),CONCATENATE(\". To reduce malic acid: \",(VLOOKUP(\"Malic Acid Degradation\",'SpecApp-Yeast Mapping'!$A$1:$I$3,IF(D8=\"Lallemand\",2,IF(D8=\"Laffort\",3,IF(D8=\"Enartis\",4,IF(D8=\"Red Star\",5,IF(D8=\"White Labs\",6,IF(D8=\"Wyeast\",7,IF(D8=\"Renaissance\",8,IF(D8=\"AB Biotek\",9,\"ERROR\")))))))),FALSE))),IF(F8=\"YES\",\". There are no malic-degrading yeasts for this vendor.\",\"\"))))","v":""},{"$f":"IF(OR(OR((AND(ISBLANK(C8),ISBLANK(D8)))),OR(I8=\"No recommendations\",I8=\"Select a Grape Variety\",I8=\"Select a Vendor\")),\"\",IF(G8<>\"\",(IF(OR(D8=\"Lallemand\",D8=\"Laffort\",D8=\"Enartis\",D8=\"Red Star\",D8=\"Renaissance\",D8=\"AB Biotek\"),CONCATENATE(ROUNDUP(((IF($G$5=\"L\",1,(IF($G$5=\"hL\",100,3.79))))*G8*(IF(E8<>\"YES\",0.25,0.35))),0),\" g\"),CONCATENATE(ROUNDUP(((IF($G$5=\"L\",1,(IF($G$5=\"hL\",100,3.79))))*(G8/23)*(IF(E8<>\"YES\",1,1.4))),0),\" X \",IF(D8=\"White Labs\",\"35\",\"125\"),\"-mL packs\"))),\"Enter a Volume\"))","v":""}]
[null,null,null,null,null,null,null,null,{"$f":"IF(OR(ISBLANK(C9),ISBLANK(D9)),(IF(AND(ISBLANK(C9),ISBLANK(D9)),IF(G9<>\"\",\"Select a Grape Variety and a Vendor\",\"\"),(IF(ISBLANK(C9),\"Select a Grape Variety\",\"Select a Vendor\")))),CONCATENATE((VLOOKUP(C9,'Variety-Yeast Mapping'!$A$1:$I$51,IF(D9=\"Lallemand\",2,IF(D9=\"Laffort\",3,IF(D9=\"Enartis\",4,IF(D9=\"Red Star\",5,IF(D9=\"White Labs\",6,IF(D9=\"Wyeast\",7,IF(D9=\"Renaissance\",8,IF(D9=\"AB Biotek\",9,\"ERROR\")))))))),FALSE)),IF(AND((VLOOKUP(\"Malic Acid Degradation\",'SpecApp-Yeast Mapping'!$A$1:$I$3,IF(D9=\"Lallemand\",2,IF(D9=\"Laffort\",3,IF(D9=\"Enartis\",4,IF(D9=\"Red Star\",5,IF(D9=\"White Labs\",6,IF(D9=\"Wyeast\",7,IF(D9=\"Renaissance\",8,IF(D9=\"AB Biotek\",9,\"ERROR\")))))))),FALSE))<>\"\",F9=\"YES\"),CONCATENATE(\". To reduce malic acid: \",(VLOOKUP(\"Malic Acid Degradation\",'SpecApp-Yeast Mapping'!$A$1:$I$3,IF(D9=\"Lallemand\",2,IF(D9=\"Laffort\",3,IF(D9=\"Enartis\",4,IF(D9=\"Red Star\",5,IF(D9=\"White Labs\",6,IF(D9=\"Wyeast\",7,IF(D9=\"Renaissance\",8,IF(D9=\"AB Biotek\",9,\"ERROR\")))))))),FALSE))),IF(F9=\"YES\",\". There are no malic-degrading yeasts for this vendor.\",\"\"))))","v":""},{"$f":"IF(OR(OR((AND(ISBLANK(C9),ISBLANK(D9)))),OR(I9=\"No recommendations\",I9=\"Select a Grape Variety\",I9=\"Select a Vendor\")),\"\",IF(G9<>\"\",(IF(OR(D9=\"Lallemand\",D9=\"Laffort\",D9=\"Enartis\",D9=\"Red Star\",D9=\"Renaissance\",D9=\"AB Biotek\"),CONCATENATE(ROUNDUP(((IF($G$5=\"L\",1,(IF($G$5=\"hL\",100,3.79))))*G9*(IF(E9<>\"YES\",0.25,0.35))),0),\" g\"),CONCATENATE(ROUNDUP(((IF($G$5=\"L\",1,(IF($G$5=\"hL\",100,3.79))))*(G9/23)*(IF(E9<>\"YES\",1,1.4))),0),\" X \",IF(D9=\"White Labs\",\"35\",\"125\"),\"-mL packs\"))),\"Enter a Volume\"))","v":""}]
[null,null,null,null,null,null,null,null,{"$f":"IF(OR(ISBLANK(C10),ISBLANK(D10)),(IF(AND(ISBLANK(C10),ISBLANK(D10)),IF(G10<>\"\",\"Select a Grape Variety and a Vendor\",\"\"),(IF(ISBLANK(C10),\"Select a Grape Variety\",\"Select a Vendor\")))),CONCATENATE((VLOOKUP(C10,'Variety-Yeast Mapping'!$A$1:$I$51,IF(D10=\"Lallemand\",2,IF(D10=\"Laffort\",3,IF(D10=\"Enartis\",4,IF(D10=\"Red Star\",5,IF(D10=\"White Labs\",6,IF(D10=\"Wyeast\",7,IF(D10=\"Renaissance\",8,IF(D10=\"AB Biotek\",9,\"ERROR\")))))))),FALSE)),IF(AND((VLOOKUP(\"Malic Acid Degradation\",'SpecApp-Yeast Mapping'!$A$1:$I$3,IF(D10=\"Lallemand\",2,IF(D10=\"Laffort\",3,IF(D10=\"Enartis\",4,IF(D10=\"Red Star\",5,IF(D10=\"White Labs\",6,IF(D10=\"Wyeast\",7,IF(D10=\"Renaissance\",8,IF(D10=\"AB Biotek\",9,\"ERROR\")))))))),FALSE))<>\"\",F10=\"YES\"),CONCATENATE(\". To reduce malic acid: \",(VLOOKUP(\"Malic Acid Degradation\",'SpecApp-Yeast Mapping'!$A$1:$I$3,IF(D10=\"Lallemand\",2,IF(D10=\"Laffort\",3,IF(D10=\"Enartis\",4,IF(D10=\"Red Star\",5,IF(D10=\"White Labs\",6,IF(D10=\"Wyeast\",7,IF(D10=\"Renaissance\",8,IF(D10=\"AB Biotek\",9,\"ERROR\")))))))),FALSE))),IF(F10=\"YES\",\". There are no malic-degrading yeasts for this vendor.\",\"\"))))","v":""},{"$f":"IF(OR(OR((AND(ISBLANK(C10),ISBLANK(D10)))),OR(I10=\"No recommendations\",I10=\"Select a Grape Variety\",I10=\"Select a Vendor\")),\"\",IF(G10<>\"\",(IF(OR(D10=\"Lallemand\",D10=\"Laffort\",D10=\"Enartis\",D10=\"Red Star\",D10=\"Renaissance\",D10=\"AB Biotek\"),CONCATENATE(ROUNDUP(((IF($G$5=\"L\",1,(IF($G$5=\"hL\",100,3.79))))*G10*(IF(E10<>\"YES\",0.25,0.35))),0),\" g\"),CONCATENATE(ROUNDUP(((IF($G$5=\"L\",1,(IF($G$5=\"hL\",100,3.79))))*(G10/23)*(IF(E10<>\"YES\",1,1.4))),0),\" X \",IF(D10=\"White Labs\",\"35\",\"125\"),\"-mL packs\"))),\"Enter a Volume\"))","v":""}]
[null,null,null,null,null,null,null,null,{"$f":"IF(OR(ISBLANK(C11),ISBLANK(D11)),(IF(AND(ISBLANK(C11),ISBLANK(D11)),IF(G11<>\"\",\"Select a Grape Variety and a Vendor\",\"\"),(IF(ISBLANK(C11),\"Select a Grape Variety\",\"Select a Vendor\")))),CONCATENATE((VLOOKUP(C11,'Variety-Yeast Mapping'!$A$1:$I$51,IF(D11=\"Lallemand\",2,IF(D11=\"Laffort\",3,IF(D11=\"Enartis\",4,IF(D11=\"Red Star\",5,IF(D11=\"White Labs\",6,IF(D11=\"Wyeast\",7,IF(D11=\"Renaissance\",8,IF(D11=\"AB Biotek\",9,\"ERROR\")))))))),FALSE)),IF(AND((VLOOKUP(\"Malic Acid Degradation\",'SpecApp-Yeast Mapping'!$A$1:$I$3,IF(D11=\"Lallemand\",2,IF(D11=\"Laffort\",3,IF(D11=\"Enartis\",4,IF(D11=\"Red Star\",5,IF(D11=\"White Labs\",6,IF(D11=\"Wyeast\",7,IF(D11=\"Renaissance\",8,IF(D11=\"AB Biotek\",9,\"ERROR\")))))))),FALSE))<>\"\",F11=\"YES\"),CONCATENATE(\". To reduce malic acid: \",(VLOOKUP(\"Malic Acid Degradation\",'SpecApp-Yeast Mapping'!$A$1:$I$3,IF(D11=\"Lallemand\",2,IF(D11=\"Laffort\",3,IF(D11=\"Enartis\",4,IF(D11=\"Red Star\",5,IF(D11=\"White Labs\",6,IF(D11=\"Wyeast\",7,IF(D11=\"Renaissance\",8,IF(D11=\"AB Biotek\",9,\"ERROR\")))))))),FALSE))),IF(F11=\"YES\",\". There are no malic-degrading yeasts for this vendor.\",\"\"))))","v":""},{"$f":"IF(OR(OR((AND(ISBLANK(C11),ISBLANK(D11)))),OR(I11=\"No recommendations\",I11=\"Select a Grape Variety\",I11=\"Select a Vendor\")),\"\",IF(G11<>\"\",(IF(OR(D11=\"Lallemand\",D11=\"Laffort\",D11=\"Enartis\",D11=\"Red Star\",D11=\"Renaissance\",D11=\"AB Biotek\"),CONCATENATE(ROUNDUP(((IF($G$5=\"L\",1,(IF($G$5=\"hL\",100,3.79))))*G11*(IF(E11<>\"YES\",0.25,0.35))),0),\" g\"),CONCATENATE(ROUNDUP(((IF($G$5=\"L\",1,(IF($G$5=\"hL\",100,3.79))))*(G11/23)*(IF(E11<>\"YES\",1,1.4))),0),\" X \",IF(D11=\"White Labs\",\"35\",\"125\"),\"-mL packs\"))),\"Enter a Volume\"))","v":""}]
[null,null,null,null,null,null,null,null,{"$f":"IF(OR(ISBLANK(C12),ISBLANK(D12)),(IF(AND(ISBLANK(C12),ISBLANK(D12)),IF(G12<>\"\",\"Select a Grape Variety and a Vendor\",\"\"),(IF(ISBLANK(C12),\"Select a Grape Variety\",\"Select a Vendor\")))),CONCATENATE((VLOOKUP(C12,'Variety-Yeast Mapping'!$A$1:$I$51,IF(D12=\"Lallemand\",2,IF(D12=\"Laffort\",3,IF(D12=\"Enartis\",4,IF(D12=\"Red Star\",5,IF(D12=\"White Labs\",6,IF(D12=\"Wyeast\",7,IF(D12=\"Renaissance\",8,IF(D12=\"AB Biotek\",9,\"ERROR\")))))))),FALSE)),IF(AND((VLOOKUP(\"Malic Acid Degradation\",'SpecApp-Yeast Mapping'!$A$1:$I$3,IF(D12=\"Lallemand\",2,IF(D12=\"Laffort\",3,IF(D12=\"Enartis\",4,IF(D12=\"Red Star\",5,IF(D12=\"White Labs\",6,IF(D12=\"Wyeast\",7,IF(D12=\"Renaissance\",8,IF(D12=\"AB Biotek\",9,\"ERROR\")))))))),FALSE))<>\"\",F12=\"YES\"),CONCATENATE(\". To reduce malic acid: \",(VLOOKUP(\"Malic Acid Degradation\",'SpecApp-Yeast Mapping'!$A$1:$I$3,IF(D12=\"Lallemand\",2,IF(D12=\"Laffort\",3,IF(D12=\"Enartis\",4,IF(D12=\"Red Star\",5,IF(D12=\"White Labs\",6,IF(D12=\"Wyeast\",7,IF(D12=\"Renaissance\",8,IF(D12=\"AB Biotek\",9,\"ERROR\")))))))),FALSE))),IF(F12=\"YES\",\". There are no malic-degrading yeasts for this vendor.\",\"\"))))","v":""},{"$f":"IF(OR(OR((AND(ISBLANK(C12),ISBLANK(D12)))),OR(I12=\"No recommendations\",I12=\"Select a Grape Variety\",I12=\"Select a Vendor\")),\"\",IF(G12<>\"\",(IF(OR(D12=\"Lallemand\",D12=\"Laffort\",D12=\"Enartis\",D12=\"Red Star\",D12=\"Renaissance\",D12=\"AB Biotek\"),CONCATENATE(ROUNDUP(((IF($G$5=\"L\",1,(IF($G$5=\"hL\",100,3.79))))*G12*(IF(E12<>\"YES\",0.25,0.35))),0),\" g\"),CONCATENATE(ROUNDUP(((IF($G$5=\"L\",1,(IF($G$5=\"hL\",100,3.79))))*(G12/23)*(IF(E12<>\"YES\",1,1.4))),0),\" X \",IF(D12=\"White Labs\",\"35\",\"125\"),\"-mL packs\"))),\"Enter a Volume\"))","v":""}]
[]
[null,"COMMENTS"]

{"sheet":"Variety-Yeast Mapping","index":2,"n_rows":50,"n_cols":9,"rows_kept":50,"cut":false,"hidden":true,"merged":[]}
["VARIETAL","Lallemand","Laffort","Enartis","Red Star","White Labs","Wyeast","Renaissance","AB Biotek"]
["Aglianico","BM4X4, CLOS, ICV-D80, SYRAH","F15, FX10","ES454","Premier Rouge","WLP740, WLP750","4028, 4267, 4946","Bravo, Maestoso","No recommendations"]
["Albariño (Alvarinho)","71B-1122, Cross Evolution, DV10, QA23, R2, VIN 13","DELTA, VL1, X16","Q Citrus, Q9","Côte des Blancs, Premier Blanc","WLP730","4028, 4783","Allegro","No recommendations"]
["Alicante Bouschet","CLOS, ICV-D80, SYRAH","F15","Red Fruit","Premier Rouge","WLP740, WLP750","4028, 4267, 4946","Maestoso","No recommendations"]
["Auxerrois","71B-1122, Alchemy I","CX9, VL1, X16","ES181, Vintage White, VQ10","Côte des Blancs, Premier Blanc","WLP715, WLP730","4021, 4783","Bella","No recommendations"]
["Baco Noir","71B-1122, RC 212","F15, RB2","ES488, Q5","Premier Rouge, Premier Cuvée","WLP740, WLP770","4267, 4946","Andante, Maestoso","Maurivin B"]
["Barbera","BRL97, CLOS","F83","ES454, MB15, Q5, VQ Assmanshausen, VQ51","Premier Rouge","WLP760","4028, 4244, 4267","Bravo","No recommendations"]
["Cabernet Franc","BDX, CSM, ICV-254, ICV-GRE, RP15","F15","D20, ES488, VQ51","Premier Blanc, Premier Classique, Premier Rouge","WLP750, WLP760","4021, 4028, 4267","Bravo","No recommendations"]
["Cabernet Sauvignon","BDX, BM45, BM4X4, CSM, ICV-D21, ICV-D254, ICV-D80, ICV-GRE, RC 212, RP15","F15, FX10","D20, ES454, ES488, VQ51","Premier Blanc, Premier Classique, Premier Cuvée, Premier Rouge","WLP707, WLP750, WLP760","4028, 4267, 4946","Andante, Avante, Bravo","Maurivin B"]
["Carménère","BDX, CSM, ICV-D80","F15, F83, FX10","ES488, VQ51","Premier Rouge","WLP740, WLP750, WLP750","4028, 4267","Andante, Bravo, Brio","No recommendations"]
["Catawba","71B-1122, K1V-1116","F15","ES401","Côte des Blancs","WLP740, WLP770",4028,"Andante, Bella","No recommendations"]
["Cayuga White","QA23","DELTA, VL2","Aroma White, ES181, Q Citrus","Premier Cuvée","WLP735","4021, 4242","Allegro","No recommendations"]
["Chambourcin","71B-1122, BM45, BM4X4, CLOS, CSM, ICV-D254, ICV-D80, RC 212","F15, F83, RX60","Q5, VQ51","Premier Rouge","WLP740",4946,"Bravo","No recommendations"]
["Chardonnay","Alchemy I, BM4X4, BM45, BRG, Cross Evolution, CY3079, DV10, ICV-D21, ICV-D254, ICV-D47, QA23, VIN 13","CX9, VL1, VL2, X16","ES123, Q9, Vintage White, VQ10","Côte des Blancs, Premier Blanc, Premier Classique, Premier Cuvée","WLP707, WLP718, WLP730, WLP740, WLP760, WLP770","4021, 4028, 4242","Allegro, Bella, Vivace","No recommendations"]
["Chenin Blanc","Alchemy I, CY3079, ICV-GRE, K1V-1116, QA23, R2, VIN 13","DELTA, VL1, VL3, X16","Aroma White, ES181, Q Citrus, Q9, Vintage White","Côte des Blancs, Premier Cuvée","WLP735","4028, 4242","Allegro, TR-313","No recommendations"]
["Concord","71B-1122","F15","Red Fruit","Côte des Blancs","WLP770","4028, 4267","Andante","Maurivin B"]
["Frontenac","BM4X4, CSM, Lalvin C, RC 212, RP15","F15","ES401, ES488","Premier Rouge, Premier Cuvée","WLP750, WLP760","4028, 4267, 4946","Andante","Maurivin B"]
["Gamay","71B-1122, BRG, RC 212","F15, RB2","Red Fruit , Q5, VQ51","Premier Rouge","WLP707, WLP770","4028, 4242","Brio","Maurivin B"]
["Gewürztraminer","Cross Evolution, DV10, QA23, R2","DELTA, VL1, VL3","Aroma White, ES181, Q Citrus, Q9, VQ Assmanshausen, VQ10","Côte des Blancs","WLP720, WLP727","4021, 4242, 4783","Bella, TR-313","No recommendations"]
["Grenache","71B-1122, BM45, BM4X4, CLOS, ICV-GRE, RC212, RP15","F83, RX60","D20, ES488, MB15, VQ51","Premier Rouge","WLP760",4028,"Brio","Maurivin B"]
["La Crescent","71B-1122, Alchemy I, Lalvin C, QA23, R2, SVG, VIN 13","Delta, VL1","Q9, Q Citrus","Côte des Blancs, Premier Blanc","WLP715, WLP735","4021, 4242","TR-313","No recommendations"]
["Léon Millot","71B-1122, RP15","F15","ES488, Q5, Red Fruit","Premier Rouge, Premier Cuvée","WLP750, WLP760","4028, 4267, 4946","Andante, Bella, Maestoso","Maurivin B"]
["Malbec","BRL97, CLOS, ICV-D254, RP15","FX10","ES454, VQ51","Premier Rouge","WLP750","4028, 4244, 4267","Bravo","No recommendations"]
["Maréchal Foch","71B-1122, BM45, BRL97, RC 212, RP15","F15, RB2","ES488, Q5","Premier Rouge, Premier Cuvée","WLP750, WLP760",4946,"Andante, Bravo, Maestoso","Maurivin B"]
["Marquette","71B-1122, BM4X4, CLOS, CSM, ICV-D254, RC 212, RP15","F15, RB2, RX60","ES488, Q5","Premier Cuvée","WLP750, WLP760","4028, 4267, 4946","Andante","Maurivin B"]
["Merlot","BDX, BRL97, CSM, ICV-D21, ICV-D80, ICV-GRE, RP15, SYRAH","F15, F83, FX10, RB2","D20, ES454, ES488, VQ51","Premier Rouge","WLP740, WLP750","4028, 4267, 4767","Bravo, Maestoso","No recommendations"]
["Mourvèdre (Monastrell)","SYRAH","F83","ES454, Q5, VQ51","Premier Rouge","WLP750, WLP760","4028, 4267, 4767","Bravo, Maestoso","No recommendations"]
["Muscat (Moscato Bianco)","Cross Evolution, QA23, R2, VIN 13","VL1","ES123, Q9, Q Citrus","Côte des Blancs, Premier Blanc","WLP720","4021, 4242","Bella","No recommendations"]
["Nebbiolo","BRL97","RX60","ES454, MB15, VQ Assmanshausen, VQ51","Premier Rouge","WLP760",4244,"Andante, Bravo","No recommendations"]
["Niagara","71B-1122","DELTA","Q9","Côte des Blancs","WLP720",4242,"Allegro","No recommendations"]
["Noiret","71B-1122, BRL97, CLOS","F15","Q5, Red Fruit","Premier Rouge, Premier Cuvée","WLP750, WLP760","4028, 4267","Brio","No recommendations"]
["Norton (Cynthiana)","71B-1122, BRL97, CLOS, ICV-D254, Lalvin C, RP15","F15, RB2","ES401, ES488","Premier Cuvée","WLP750, WLP760","4028, 4267, 4946","Andante","Maurivin B"]
["Petit Verdot","BDX, BRL97, CLOS, CSM, ICV-D254, RP15, SYRAH","FX10","D20, VQ51","Premier Rouge, Premier Cuvée","WLP740, WLP750, WLP760","4028, 4244, 4267","Bravo, Brio","No recommendations"]
["Petite Sirah (Durif)","BM4X4, CLOS, ICV-D80, RP15, SYRAH","F15, FX10","D20, Q5","Premier Rouge","WLP740, WLP750","4028, 4267, 4946",null,"No recommendations"]
["Pinot Gris (Pinot Grigio)","71B-1122, Alchemy I, CY3079, DV10, QA23, R2, SVG","DELTA","Aroma White, Q Citrus, Q9, VQ10","Côte des Blancs, Premier Cuvée","WLP735","4021, 4242","Allegro, Vivace","No recommendations"]
["Pinot Noir","BRG, BRL97, RC 212","F15, RB2","ES454, ES488, MB15, VQ Assmanshausen, WS","Premier Rouge","WLP707, WLP740, WLP749, WLP770","4028, 4946","Brio","Maurivin B"]
["Pinotage","BM4X4, ICV-D80","F15, FX10, RX60","MB15, Q5, Q7","Premier Rouge","WLP740, WLP750","4021, 4946","Maestoso","Maurivin B"]
["Riesling","71B-1122, Alchemy I, ICV-GRE, QA23, R2, SVG","DELTA, VL1, VL3, X5","Aroma White, ES123, ES181, Q Citrus, Q9, VQ Assmanshausen, VQ10","Côte des Blancs","WLP720, WLP727, WLP749",4783,"Bella, TR-313, Vivace","No recommendations"]
["Sangiovese","BM45, BM4X4, ICV-D254","F83","D20, MB15, VQ Assmanshausen, VQ51","Premier Rouge","WLP760","4028, 4244, 4267, 4767","Andante, Avante","No recommendations"]
["Sauvignon Blanc","Alchemy I, QA23, R2, SVG, VIN 13","DELTA, VL1, VL3, X5","Aroma White, ES181, Q Citrus, Q9, VQ10, Vintage White","Côte des Blancs","WLP740, WLP750, WLP770","4021, 4028, 4267","TR-313, Vivace","No recommendations"]
["Scuppernong","Lalvin C, VIN 13","DELTA","Top Essence","Premier Blanc","WLP720","4028, 4783","Allegro","No recommendations"]
["Seyval Blanc","71B-1122, Alchemy I, QA23, SVG","DELTA, VL2","Q9, Top Essence, Vintage White","Côte des Blancs, Premier Cuvée","WLP735","4021, 4028, 4783","Allegro","No recommendations"]
["St. Croix","71B-1122, CLOS, CSM","F15","ES454, ES488","Premier Rouge, Premier Cuvée","WLP740, WLP750","4028, 4267","Bravo","No recommendations"]
["Syrah (Shiraz)","BDX, CLOS, ICV-D21, ICV-D254, ICV-D80, ICV-GRE, RP15, SYRAH","F83, RX60","D20, ES454, Q5, Q7, VQ Assmanshausen, VQ51","Premier Rouge","WLP740","4028, 4267, 4946","Andante, Avante, Bravo, Brio","Maurivin B"]
["Tempranillo","CLOS, RP15","RX60","Q5","Premier Cuvée","WLP750, WLP760","4028, 4244, 4267, 4767","Maestoso","No recommendations"]
["Touriga Nacional","BDX, CLOS, ICV-D21, ICV-D254, ICV-D80, ICV-GRE, RP15, SYRAH","F15, F83, FX10, RX60","Q5","Premier Rouge","WLP740","4028, 4767, 4946","Maestoso","No recommendations"]
["Traminette","Alchemy I, QA23, R2, VIN 13","Delta, VL1","Q9, Q Citrus, VQ Assmanshausen, VQ10","Côte des Blancs, Premier Cuvée","WLP735","4021, 4242, 4783","TR-313","No recommendations"]
["Vidal Blanc","71B-1122, Alchemy I, K1V-1116, QA23, R2","DELTA, VL1, VL2","Q9, Q Citrus, Vintage White, VQ10","Côte des Blancs, Premier Cuvée","WLP715, WLP735",4783,"Bella","No recommendations"]
["Viognier","Cross Evolution, ICV-D254, ICV-D47, ICV-GRE, QA23, R2, SVG, VIN 13","DELTA, VL2","Aroma White, ES181, Q Citrus, Q9","Premier Blanc","WLP715, WLP735","4028, 4267","Allegro","No recommendations"]
["Zinfandel (Primitivo)","BDX, BM45, BM4X4, BRL97, CLOS, ICV-D21, ICV-D254, ICV-D80, RP15","F15","D20, ES454, MB15, Q7, VQ Assmanshausen, VQ51, WS","Premier Rouge","WLP749, WLP760","4028, 4767, 4946","Andante, Avante","Maurivin B"]

{"sheet":"SpecApp-Yeast Mapping","index":3,"n_rows":3,"n_cols":9,"rows_kept":3,"cut":false,"hidden":true,"merged":[]}
["APPLICATION","Lallemand","Laffort","Enartis","Red Star","White Labs","Wyeast","Renaissance","AB Biotek"]
["Restart Stuck Fermentation","K1V-1116, Lalvin C, Uvaferm 43 RESTART","BO213","EZ Ferm 44, WS","Premier Blanc, Premier Cuvée","No recommendation",4946,"No recommendation","No recommendation"]
["Malic Acid Degradation","71B-1122, Lalvin C","F15, RB2, X16, BO213","ES401, ES488","Côte des Blancs, Premier Blanc",null,null,"Allegro, Andante","Maurivin B"]

{"sheet":"Lists","index":4,"n_rows":51,"n_cols":27,"rows_kept":51,"cut":false,"hidden":true,"merged":[[0,21,0,22],[0,24,0,25],[0,3,0,4],[0,6,0,7],[0,9,0,10],[0,12,0,13],[0,15,0,16],[0,18,0,19]]}
["GRAPE VARIETIES","VENDOR",null,"Lallemand",null,null,"Laffort",null,null,"Enartis",null,null,"Red Star",null,null,"White Labs",null,null,"Wyeast",null,null,"Renaissance",null,null,"AB Biotek"]
["Other","Lallemand",null,"71B-1122","Low",null,"F15","Med",null,"Aroma White","Med/High",null,"Premier Rouge","High",null,"WLP707","Med",null,4021,"Med",null,"Allegro","Med",null,"Maurivin B","Low","when adding varieties, be sure to update cell references in Yeast Selector sheet, column G"]
["Aglianico","Laffort",null,"Alchemy I","Med",null,"F83","Med",null,"D20","Med",null,"Premier Classique","Low",null,"WLP715","Med",null,4028,"Med",null,"Andante","Med"]
["Albariño (Alvarinho)","Enartis",null,"BDX","Med",null,"FX10","Low",null,"ES123","High",null,"Côte des Blancs","High",null,"WLP718","Med",null,4242,"Med",null,"Avante","Med"]
["Alicante Bouschet","Red Star",null,"BM45","High",null,"RB2","Low",null,"ES181","Low",null,"Premier Blanc","Very Low",null,"WLP720","Med",null,4244,"Med",null,"Bella","High"]
["Auxerrois","White Labs",null,"BM4X4","High",null,"RX60","High",null,"ES401","Med/High",null,"Premier Cuvée","Very Low",null,"WLP727","Med",null,4267,"Med",null,"Bravo","Med"]
["Baco Noir","Wyeast",null,"BRG","High",null,"CX9","Low",null,"ES454","Med",null,null,null,null,"WLP730","Med",null,4767,"Med",null,"Brio","Med"]
["Barbera","Renaissance",null,"BRL97","Med",null,"DELTA","High",null,"ES488","High",null,null,null,null,"WLP735","Med",null,4783,"Med",null,"Maestoso","High"]
["Cabernet Franc","AB Biotek",null,"CLOS","Med",null,"VL1","High",null,"EZ Ferm 44","Low",null,null,null,null,"WLP740","High",null,4946,"Med",null,"TR-313","Med"]
["Cabernet Sauvignon",null,null,"Cross Evolution","Low",null,"VL2","Med",null,"MB15","Low/Med",null,null,null,null,"WLP749","Med",null,null,null,null,"Vivace","High"]
["Carménère",null,null,"CSM","Med",null,"VL3","High",null,"Q Citrus","Med",null,null,null,null,"WLP750","Med"]
["Catawba",null,null,"CY3079","High",null,"X5","High",null,"Q5","Med",null,null,null,null,"WLP760","Med"]
["Cayuga White",null,null,"DV10","Low",null,"X16","Med",null,"Q7","Med",null,null,null,null,"WLP770","High"]
["Chambourcin",null,null,"EC-1118","Low",null,"BO213","Low",null,"Q9","Med/High"]
["Chardonnay",null,null,"ICV-D21","Med",null,"ROSÉ","Med",null,"Red Fruit","High"]
["Chenin Blanc",null,null,"ICV-D254","Med",null,null,null,null,"Top Essence","Med"]
["Concord",null,null,"ICV-D47","Low",null,null,null,null,"Vintage Red","Med"]
["Frontenac",null,null,"ICV-D80","High",null,null,null,null,"Vintage White","Med/High"]
["Gamay",null,null,"ICV-GRE","Med",null,null,null,null,"VQ Assmanshausen","Med"]
["Gewürztraminer",null,null,"K1V-1116","Med",null,null,null,null,"VQ10","Low"]
["Grenache",null,null,"Lalvin C","Low",null,null,null,null,"VQ51","Med"]
["La Crescent",null,null,"QA23","Low",null,null,null,null,"WS","Low"]
["Léon Millot",null,null,"R2","High"]
["Malbec",null,null,"RC 212","Med"]
["Maréchal Foch",null,null,"RP15","Med"]
["Marquette",null,null,"SVG","Med"]
["Merlot",null,null,"SYRAH","Med"]
["Mourvèdre (Monastrell)",null,null,"Uvaferm 43 RESTART","Low"]
["Muscat (Moscato Bianco)",null,null,"VIN 13","Low"]
["Nebbiolo"]
["Niagara"]
["Noiret"]
["Norton (Cynthiana)"]
["Petit Verdot"]
["Petite Sirah (Durif)"]
["Pinot Gris (Pinot Grigio)"]
["Pinot Noir"]
["Pinotage"]
["Riesling"]
["Sangiovese"]
["Sauvignon Blanc"]
["Scuppernong"]
["Seyval Blanc"]
["St. Croix"]
["Syrah (Shiraz)"]
["Tempranillo"]
["Touriga Nacional"]
["Traminette"]
["Vidal Blanc"]
["Viognier"]
["Zinfandel (Primitivo)"]